[Flac-dev] OS X compile errors

Glenn glenn at meaning.com
Tue Jan 7 19:55:01 PST 2003

I just tried to compile FLAC 1.0.5 beta1 under Apple's X11 v0.1 
(released today) and it didn't work. The error message was:

file_decoder.c: In function `_declspec':
file_decoder.c:477: warning: unused parameter `dllimport'
file_decoder.c:478: warning: unused parameter 
make[4]: *** [file_decoder.lo] Error 1
make[3]: *** [all-recursive] Error 1
make[2]: *** [all-recursive] Error 1
make[1]: *** [all-recursive] Error 1
make: *** [all] Error 2
[TLB:~/Desktop/flac-1.0.5_beta1/flac-1.0.5_beta1] glenn%

I've attached a complete log of the install. I've also got 
fink/OroborOSX installed and I don't know if that is affecting anything.

I've got xmms installed (via fink) and I'd really like to get the 
xmms-flac plugin to work.



-------------- next part --------------
A non-text attachment was scrubbed...
Name: flac-errors.rtf
Type: application/rtf
Size: 112531 bytes
Desc: not available
Url : http://lists.xiph.org/pipermail/flac-dev/attachments/20030107/c73ddf1e/flac-errors.rtf

More information about the Flac-dev mailing list